BDBM50066777 5-Benzyl-4-methyl-pyrrolidin-(2E)-ylideneamine; hydrochloride::CHEMBL552936
SMILES CC1CC(N)=NC1Cc1ccccc1
InChI Key InChIKey=QAMVVXGBLGQJGJ-UHFFFAOYSA-N
Data  6 IC50
  Tab Delimited (TSV)   2D SDfile   Computed 3D by Vconf -m prep SDfile
Find this compound or compounds like it in BindingDB:
Activity Spreadsheet -- Enzyme Inhibition Constant Data from BindingDB
Found 2 hits for monomerid = 50066777
TargetNitric oxide synthase, endothelial(Homo sapiens (Human))
Pfizer
Curated by ChEMBL
LigandPNGBDBM50066777(5-Benzyl-4-methyl-pyrrolidin-(2E)-ylideneamine; hy...)
Affinity DataIC50:  4.58E+5nM. Assay description: Inhibition of cloned (from RNA) human endothelial constitutive Endothelial nitric oxide synthase (heNOS)
In DepthDetails ArticlePubMed
TargetNitric oxide synthase, endothelial(Homo sapiens (Human))
Pfizer
Curated by ChEMBL
LigandPNGBDBM50066777(5-Benzyl-4-methyl-pyrrolidin-(2E)-ylideneamine; hy...)
Affinity DataIC50:  4.58E+5nM. Assay description: Inhibition of cloned (from RNA) human endothelial constitutive Endothelial nitric oxide synthase (heNOS)
In DepthDetails ArticlePubMed